{"text_format":"1","workbook":"xlsx","n_sheets":2,"sheets":["Aanvraagformulier","Parameters"],"not_rendered":{"charts":0,"images":5,"macros":1,"external_links":0,"defined_names":3,"comments":0,"pivot_tables":0},"unopened":[],"bounds":{"document_bytes":16777216,"sheet_cells":100000,"rows_first":2000,"rows_last":500,"rows_between":2000,"halvings":0,"cell_chars":16384,"cell_head_chars":4096},"cells_cut":0,"cells_raw":0,"read":"whole","date_system":"1900"}

{"sheet":"Aanvraagformulier","index":0,"n_rows":145,"n_cols":11,"rows_kept":145,"cut":false,"hidden":false,"merged":[[121,6,126,9],[121,0,126,3],[117,1,117,3],[117,7,117,9],[35,0,35,1],[35,8,35,9],[36,0,36,1],[36,8,36,9],[36,4,36,5],[39,0,44,10],[0,0,1,6],[74,0,75,6],[112,6,113,10],[47,0,47,4],[4,8,4,9],[6,8,6,9],[56,0,56,10]]}
["AANVRAAGFORMULIER VOEDSELBANK"]
[]
[]
["Niet volledig ingevulde formulieren worden niet in behandeling genomen."]
["Dit formulier bestaat uit twee pagina’s.",null,null,null,null,null,null,null,{"$f":"IF(B118>0,B118,\" \")","v":" "}]
[]
[null,null,null,null,null,null,"Uitdeelpost",null,""]
["Algemene gegevens"]
[]
["Gegevens aanvragende instantie"]
["Naam:"]
["Adres: "]
["Postcode/plaats: "]
["Telefoon/e-mail: "]
["Hulpverlener: "]
["Telefoon:"]
["E-mail:"]
[]
["Gegevens ontvanger"]
["Naam:"]
["Adres:"]
["Postcode/plaats: "]
["Telefoon: "]
["E-mail: "]
["Burgerlijke staat: "]
[]
[null,null,null,null,{"$f":"IF(Parameters!C9=\"ALLEENSTAAND\",\"Vul geslacht en geboortedatum aanvrager in:\",\"Vul geslacht en geboortedatum van zowel aanvrager als partner in:\")","v":"Vul geslacht en geboortedatum van zowel aanvrager als partner in:"}]
[]
[null,null,null,null,"Geboortedatum:",null,"Geslacht"]
[]
[null,null,null,null,"Geboortedatum:",null,"Geslacht"]
[]
[]
["Inwonende kinderen"]
["Geb. d.d.",null,"Geslacht ",null,"Geb. d.d. ",null,"Geslacht ",null,"Geb. d.d. ",null,"Geslacht "]
[]
[]
[]
["Toelichting waarom ondersteuning gewenst/noodzakelijk is:"]
[]
[]
[]
[]
[]
[]
[]
[]
["Aanvullende informatie hulpverlening"]
["Is er sprake van leefgeld?"]
[]
[]
[null,null,{"$f":"IF(E48=\"Nee\",\"Ga door naar de inkomenstoets en daarna ondertekening\",IF(E48=\"Ja\",\"Vul leefgeld en maand/week in\",\"\"))","v":""}]
[]
[null,null,null,null,"Leefgeld","Maand/Week"]
[]
[]
[{"$f":"IF(E55<\"\",\"ga door naar ondertekening tenzij rekeningen betaald moeten worden van het leefgeld.\",\"\")","v":""}]
[]
[]
[]
[]
[]
[]
["Privacy Statement: Voedselbanken Nederland respecteert de privacy van de door de aanvrager verstrekte gegevens. "]
["De Voedselbank geeft de vastgelegde gegevens niet ter beschikking of inzage van derden tenzij wettelijk daartoe "]
["verplicht. De gegevens worden uitsluitend gebruikt ten behoeve van en in overeenstemming met het realiseren van de "]
["doelstellingen van de Voedselbank."]
[]
["doelstellingen van de Voedselbank."]
["Door ondertekening van dit formulier gaat de aanvrager akkoord met het privacy statement."]
["Na inschrijving worden de bijgevoegde documenten vernietigd."]
[]
[null,null,null,null,{"$f":"SUBSTITUTE(E20,0,\"\")","v":""}]
[]
["AANVRAAGFORMULIER VOEDSELBANK"]
[]
[]
[]
["Niet volledig ingevulde formulieren worden niet in behandeling genomen."]
["Dit formulier bestaat uit twee pagina’s."]
[]
["Inkomenstoets",null,"(Bedragen per maand invullen)"]
[]
[]
["inkomen *",null,null,null,null,null,"Uitgaven *"]
["Type inkomen: (Werk, WWB, UWV, enz.)"]
["Loon/uitkering:  ",null,null,null,null,null,"Huur/hypotheek:"]
["Huurtoeslag: ",null,null,null,null,null,"Energie/water: "]
["Zorgtoeslag: ",null,null,null,null,null,"Ziektekosten:"]
["Kindgebonden budget:",null,null,null,null,null,"Overige verzekeringen:"]
[null,null,null,null,null,null,"Eigen bijdrage (thuiszorg e.d.): "]
["Overige inkomsten (specificeren):",null,null,null,null,null,"Overige uitgaven (specificeren):"]
[null,null,null,null,null,null,"tv + internet + telefoon:"]
[null,null,null,null,null,null,"Aflossingen:"]
[]
[]
["Subtotaal inkomsten: ",null,null,null,{"$f":"IF(SUM(E87:E96)=0,\"\",SUM(E87:E96))","v":""},null,"Subtotaal uitgaven: ",null,null,null,{"$f":"IF(SUM(K87:K96)=0,\"\",SUM(K87:K96))","v":""}]
["Subtotaal uitgaven: ",null,null,null,{"$f":" K97","v":""}]
["Netto vrij te besteden:",null,null,null,{"$f":"IF(E98=\"\",\"\",E97-E98)","v":""}]
[]
[]
["* Voor alle inkomsten/uitgaven dienen bewijzen bijgevoegd te worden."]
["Formulieren zonder bewijzen worden niet in behandeling genomen."]
[]
[]
[]
[]
[]
[]
[]
["Ondertekening"]
[]
["Ondertekening (door hulpverlener) ",null,null,null,null,null,"Ondertekening (door aanvrager voor akkoord \nregistratie persoonsgegevens, zie privacy statement)"]
[]
[]
["Plaats: ",null,null,null,null,null,"Plaats: ",null,{"$f":"SUBSTITUTE(I7,0,\"\")","v":""}]
[]
["Datum: ",null,null,null,null,null,"Datum :"]
[]
[]
["Handtekening",null,null,null,null,null,"Handtekening"]
[]
[]
[]
[]
[]
[]
[]
[]
[]
[]
[]
[]
[]
[]
[]
[]
[]
[]
["Privacy Statement: Voedselbanken Nederland respecteert de privacy van de door de aanvrager verstrekte gegevens. "]
["De Voedselbank geeft de vastgelegde gegevens niet ter beschikking of inzage van derden tenzij wettelijk daartoe "]
["verplicht. De gegevens worden uitsluitend gebruikt ten behoeve van en in overeenstemming met het realiseren van de "]
["doelstellingen van de Voedselbank. "]
["Door ondertekening van dit formulier gaat de aanvrager akkoord met het privacy statement."]
["Na inschrijving worden de bijgevoegde documenten vernietigd."]

{"sheet":"Parameters","index":1,"n_rows":9,"n_cols":4,"rows_kept":9,"cut":false,"hidden":false,"merged":[]}
["Uitdeelpost","Sekse","Ja/Nee","Week/Maand"]
["Brielle","Man","Ja","Week"]
["Goeree","Vrouw","Nee","Maand"]
["Hoeksche Waard"]
["Spijkenisse"]
["Rozenburg"]
[]
[]
["Input",1,{"$f":"CHOOSE(INPUT_OBJECT,\"Gehuwd/Samenwonend\",\"Alleenstaand\")","v":"Gehuwd/Samenwonend"}]